{"text_format":"1","workbook":"xlsx","n_sheets":12,"sheets":["FORSIDE","INFORMASJON","Tidsplan","Lørdag løp","Lørdag Trekning","Søndg løp","LØPSOPPSETT OPPSLAG","Søndag Trekning","Krysstabell","FORMATERINGER","Startnr","KART"],"not_rendered":{"charts":0,"images":1,"macros":1,"external_links":0,"defined_names":29,"comments":2,"pivot_tables":1},"unopened":[],"bounds":{"document_bytes":16777216,"sheet_cells":100000,"rows_first":2000,"rows_last":500,"rows_between":2000,"halvings":0,"cell_chars":16384,"cell_head_chars":4096},"cells_cut":0,"cells_raw":0,"read":"whole","date_system":"1900"}

{"sheet":"FORSIDE","index":0,"n_rows":19,"n_cols":2,"rows_kept":19,"cut":false,"hidden":false,"merged":[]}
[null,"Trekning \nmed løpsoppsett\nRev A 19.08 0900"]
[]
[]
[null,"til"]
[]
[null,"KJØRBOSPRINTEN 2016"]
[null,"med Sprintmesterskapet \nog Oslo Kretsmesterskap"]
[null," "]
[]
[null,"Kalvøya Sandvika"]
[]
[]
[null,"Lørdag 27. og søndag 28. august 2016"]
[]
[]
{"$rows_left_out":5}
{"sheet":"INFORMASJON","index":1,"n_rows":58,"n_cols":5,"rows_kept":58,"cut":false,"hidden":false,"merged":[[40,1,40,4],[43,1,43,4],[0,0,0,4],[1,0,1,4],[22,1,22,4],[24,1,24,4],[28,1,28,4],[9,1,9,4],[33,1,33,4],[45,1,45,4],[50,1,50,4],[54,1,54,4],[20,1,20,4],[30,1,30,4],[38,1,38,4],[39,1,39,4],[41,1,41,4],[42,1,42,4],[36,1,36,4],[37,1,37,4],[47,1,47,4],[49,1,49,4],[48,1,48,4],[44,1,44,4],[35,1,35,4]]}
["KJØRBOSPRINTEN 2016 27.–28. august"]
["med Sprintmersterkapet og Oslo Kretsmesterskap"]
[]
["Regattaarrangør:","Bærum Roklubb"]
[]
["Start finaler:","Lørdag kl. 12.00","Søndag kl. 12.00"]
[]
["Påmeldingsfrist:","Arrangør i hende innen onsdag 17. august kl. 24:00"]
[null,null," "," "," "]
["Påmeldingsadresse:","Påmeldinger sendes via SportsAdmin (se http://www.roing.no). (regattareglementet §23/forskrift til §23).\nUtenlandske roklubber sender påmeldinger til: regatta@baerum-roklubb.no , merket Kjørbosprinten"]
[]
["Kontaktpersoner:","Formann regattakomiteen:","Tore Gulli","Mobil:  907 77 278"]
[null,"Regattakoordinator:","Reidar Mandt","Mobil:  907 36 432"]
[null,"Regattakontor:","Sigmund Bragstad","Mobil:  906 98 688"]
[null,"Regattakontor:"]
{"$rows_left_out":44}
{"sheet":"Tidsplan","index":2,"n_rows":103,"n_cols":15,"rows_kept":103,"cut":false,"hidden":false,"merged":[]}
["LØPSDAG","LØP NR","FORSØKSLØP","FINALER",null,"Rendom 1","\"Hjemme-klubb\"","Påmeldt av (person)","Mobil","E-post","Påmeldt dato",null,null,"VEIING"]
["Lørdag 22.08.2015","121F","0930",{"$f":"VLOOKUP(LEFT(B2,3)*1,B:D,3,FALSE)","v":"1420"},14]
["Lørdag 22.08.2015","111F","0945",{"$f":"VLOOKUP(LEFT(B3,3)*1,B:D,3,FALSE)","v":"1245"},11]
["Lørdag 22.08.2015","122F","0955",{"$f":"VLOOKUP(LEFT(B4,3)*1,B:D,3,FALSE)","v":"1425"},7]
["Lørdag 22.08.2015",102,null,"1005",10]
["Lørdag 22.08.2015",101,{"$f":"IFERROR(VLOOKUP(B6&\"F\",B:D,2,FALSE),\"\")","v":""},"1015",23]
[]
["LAGLEDERMØTE","1LLM","LAGLEDERMØTE","1100"]
["Lørdag 22.08.2015",103,{"$f":"IFERROR(VLOOKUP(B9&\"F\",B:D,2,FALSE),\"\")","v":""},"1200"]
["Lørdag 22.08.2015",105,"","1205"]
["Lørdag 22.08.2015",106,"","1210"]
["Lørdag 22.08.2015",107,"","1215",17]
["Lørdag 22.08.2015",108,"","1230"]
["Lørdag 22.08.2015",109,"","1235"]
["Lørdag 22.08.2015",110,"","1240"]
{"$rows_left_out":89}
{"sheet":"Lørdag løp","index":3,"n_rows":48,"n_cols":8,"rows_kept":48,"cut":false,"hidden":false,"merged":[[2,1,2,2],[0,0,0,7],[5,0,5,7]]}
["LØPSOPPSETT LØRDAG"]
["DAG","Løp nr.","Kjønn","Klasse","Båttype","Distanse","ANNET","Startkontingent"]
["Lørdag","FORSØKSLØP\nFORSØKSLØP"]
[null,101,"H","JB","1x",500," ",275]
[null,102,"D","JB","1x",500,"K",275]
["Pause\nLAGLEDERMØTE kl. 11.00"]
[null,103,"D/H","Nybeg","Åpen",500," ",150]
[null,{"$f":"B7+1","v":104},"D/H","JD","2x",500,null,275]
[null,{"$f":"B8+1","v":105},"H","JA","8+",500,"SP/K",475]
[null,106,"H","JC","1x",500," ",275]
[null,107,"D","JC","2x",500," ",325]
[null,108,"D","S","1x",500,"SP",275]
[null,109,"D","JA","2x",500,"SP",325]
[null,110,"D","S","2-",500,null,325]
[null,111,"H","JA","1x",500,"K",275]
{"$rows_left_out":34}
{"sheet":"Lørdag Trekning","index":4,"n_rows":279,"n_cols":46,"rows_kept":279,"cut":false,"hidden":false,"merged":[]}
[{"$f":"COLUMNS($A1:A1)","v":1},{"$f":"COLUMNS($A1:B1)","v":2},{"$f":"COLUMNS($A1:C1)","v":3},{"$f":"COLUMNS($A1:D1)","v":4},{"$f":"COLUMNS($A1:E1)","v":5},{"$f":"COLUMNS($A1:F1)","v":6},{"$f":"COLUMNS($A1:G1)","v":7},{"$f":"COLUMNS($A1:H1)","v":8},{"$f":"COLUMNS($A1:I1)","v":9},{"$f":"COLUMNS($A1:J1)","v":10},{"$f":"COLUMNS($A1:K1)","v":11},{"$f":"COLUMNS($A1:L1)","v":12},{"$f":"COLUMNS($A1:M1)","v":13},{"$f":"COLUMNS($A1:N1)","v":14},{"$f":"COLUMNS($A1:O1)","v":15},{"$f":"COLUMNS($A1:P1)","v":16},{"$f":"COLUMNS($A1:Q1)","v":17},{"$f":"COLUMNS($A1:R1)","v":18},19,20,21,{"$f":"COLUMNS($A1:V1)","v":22},{"$f":"COLUMNS($A1:W1)","v":23},{"$f":"COLUMNS($A1:X1)","v":24},{"$f":"COLUMNS($A1:Y1)","v":25},{"$f":"COLUMNS($A1:Z1)","v":26},null,{"$f":"COLUMNS($A1:AB1)","v":28},{"$f":"COLUMNS($A1:AC1)","v":29},{"$f":"COLUMNS($A1:AD1)","v":30},{"$f":"COLUMNS($A1:AE1)","v":31},{"$f":"COLUMNS($A1:AF1)","v":32},{"$f":"COLUMNS($A1:AG1)","v":33},{"$f":"COLUMNS($A1:AH1)","v":34},{"$f":"COLUMNS($A1:AI1)","v":35},{"$f":"COLUMNS($A1:AJ1)","v":36},{"$f":"COLUMNS($A1:AK1)","v":37},{"$f":"COLUMNS($A1:AL1)","v":38},{"$f":"COLUMNS($A1:AM1)","v":39},{"$f":"COLUMNS($A1:AN1)","v":40},{"$f":"COLUMNS($A1:AO1)","v":41},{"$f":"COLUMNS($A1:AP1)","v":42},{"$f":"COLUMNS($A1:AQ1)","v":43},{"$f":"COLUMNS($A1:AR1)","v":44},{"$f":"COLUMNS($A1:AS1)","v":45},{"$f":"COLUMNS($A1:AT1)","v":46}]
[null,null,null,null,null,null,null,null,null,null,null,null,null,null,null,null,null,null,3,5,6]
[null,null,null,null,null,null,null,null,null,null,null,null,null,null,null,null,null,{"$f":"SUBTOTAL(3,R4:R281)-1","v":235},null,null,null,null,null,null,null,null,{"$f":"SUBTOTAL(9,AA4:AA281)-1","v":19},null,{"$f":"SUBTOTAL(3,AC4:AC281)-1","v":222}]
["ID","Oppslag","LØPSDAG","LØP NR","Plassering","Start Finale","Start Forsøk","Veiing","Forsøk","Slått ut","Semifinale","Start Forsøk","Rendom 1","random","Sprintmesterskap (S)","Kretsmesterslap (K)","Heat","Startnr","Heat actual","Plassering","Tid","Plass x Heat","Poeng","Kjønn","Klasse","Båttype","Deltakere (seter)","Distanse","Roklubb","ROERE","NC Kvalifisering Nordisk/Baltic","START-KONTIGENT","Etteranmeldt/Strøket","Påmeldene/Betalende klubb","Betaling registrert","Betalingstransaksjon","Fødselsdato","Påmelding innenfor klasse (ja/nei)","Idrettsnummer","Person ID","Betalt lisens","\"Hjemme-klubb\"","Påmeldt av (person)","Mobil","E-post","Påmeldt dato"]
[{"$f":"D5&R5","v":"121F0"},0,"Lør 27.8","121F",0,{"$f":"VLOOKUP($D5,Tidsplan!$B:$D,3,FALSE)","v":"1420"},{"$f":"VLOOKUP($D5,Tidsplan!$B:$D,2,FALSE)","v":"0930"},null,null,null,null," ",null,null,null,"K",null,0,null,null,null,null,null,"H","H J B","2x",{"$f":"IF(R5<>0,LEFT(Z5,1),0)*1","v":0},"500 m "]
[{"$f":"D6&R6","v":"121F1"},{"$f":"OFFSET(B6,-1,0)","v":0},"Lør 27.8","121F",null,{"$f":"OFFSET(F6,-1,0)","v":"1420"},"0930",null,null,null,null,null,17,null,null,null,1,1,1,null,null,null,null,"H","H J B","2x",null,"500 m ","Bærum Roklubb 4","sindre fuglseth\nBrage Bragstad",null,325,null,"Bærum Roklubb",null,null,"26.09.2000\n12.09.2000","Ja\nJa","M260900SIN02\nM120900BRA03","6073987\n4908711","29.04.2016\n29.04.2016","Bærum Roklubb\nBærum Roklubb","Anders Hovde\n","90775520\n","anders.hovde@tns-gallup.no\n","17.08.2016\n17.08.2016"]
["121F2",0,"Lør 27.8","121F",null,"1420","0930",null,null,null,null,null,148,null,null,null,1,{"$f":"1+R6","v":2},1,null,null,null,null,"H","H J B","2x",null,"500 m ","Norske Studenters Roklub 1","Kristian Søhr\nSam Lorgen",null,325,null,"Norske Studenters Roklub",null,null,"14.04.2000\n02.04.2000","Ja\nJa","M140400KRI01\nM020400SAM02","4077003\n6722466","26.04.2016\n26.04.2016","Norske Studenters Roklub\nNorske Studenters Roklub","Tor-geir Myhrer\n","90060234\n","rosjefen@gmail.com\n","17.08.2016\n17.08.2016"]
["121F3",0,"Lør 27.8","121F",null,"1420","0930",null,null,null,null,null,190,null,null,null,1,{"$f":"1+R7","v":3},1,null,null,null,null,"H","H J B","2x",null,"500 m ","Ormsund Roklub 1","Jonathan K Dysvik\nErlend Hystad",null,325,null,"Ormsund Roklub",null,null,"12.05.2001\n01.12.2002","Ja\nNei","M120501JON09\nM011202ERL01","2820892\n4859156","11.03.2016\n11.03.2016","Ormsund Roklub\nOrmsund Roklub","Antje Peine\n","+4792863244\n","antjep13@gmail.com\n","17.08.2016\n17.08.2016"]
["121F4",0,"Lør 27.8","121F",null,"1420","0930",null,null,null,null,null,378,null,null,null,1,4,1,null,null,null,null,"H","H J B","2x",null,"500 m ","Moss Roklubb 1","Jarle Hjortkjær Sæby\nMagnus strømme",null,325,null,"Moss Roklubb",null,null,"17.08.2000\n15.11.2001","Ja\nJa","M170800JAR02\nM151101MAG07","2794789\n6045066","05.04.2016\n05.04.2016","Moss Roklubb\nMoss Roklubb","Jon Rekstad\n","92252667\n","rekstad0@gmail.com\n","17.08.2016\n17.08.2016"]
["121F5",0,"Lør 27.8","121F",null,"1420","0930",null,null,null,null,null,412,null,null,null,1,5,1,null,null,null,null,"H","H J B","2x",null,"500 m ","Drammen Roklubb  1","Bjørn Tarald Rosfjord Wik\nElias Loe Eritsland",null,325,null,"Drammen Roklubb ",null,null,"24.11.2001\n13.02.2001","Ja\nJa","M241101BJØ02\nM130201ELI01","7310641\n6756069","17.08.2016\n15.03.2016","Drammen Roklubb \nDrammen Roklubb ","Øyvind Leirset\n","40069485\n","oeylei@online.no;Oeylei@online.no\n","17.08.2016\n17.08.2016"]
["121F6",0,"Lør 27.8","121F",null,"1420","0930",null,null,null,null,null,476,null,null,null,2,6,2,null,null,null,null,"H","H J B","2x",null,"500 m ","Bærum Roklubb 3","Petter Bratli\nØystein Dingen Endresen",null,325,null,"Bærum Roklubb",null,null,"17.06.2000\n07.06.2000","Ja\nJa","M170600PET02\nM070600ØYS01","5956457\n5372192","29.04.2016\n29.04.2016","Bærum Roklubb\nBærum Roklubb","Anders Hovde\n","90775520\n","anders.hovde@tns-gallup.no\n","17.08.2016\n17.08.2016"]
["121F7",0,"Lør 27.8","121F",null,"1420","0930",null,null,null,null,null,480,null,null,null,2,7,2,null,null,null,null,"H","H J B","2x",null,"500 m ","Christiania Roklub 2","Martin Dege\nSverre Engebretsen",null,325,null,"Christiania Roklub",null,null,"18.02.2001\n16.05.2001","Ja\nJa","M180201SVE04\nM160501MAR05","6759915\n6759918","27.05.2016\n","Christiania Roklub\nChristiania Roklub","Grete Isachsen Stokke\n","91338845\n","grisach@gmail.com\n","16.08.2016\n16.08.2016"]
["121F8",0,"Lør 27.8","121F",null,"1420","0930",null,null,null,null,null,942,null,null,null,2,8,2,null,null,null,null,"H","H J B","2x",null,"500 m ","Norske Studenters Roklub 2","Petter Arnøy\nHugo Haavind",null,325,null,"Norske Studenters Roklub",null,null,"16.02.2001\n17.05.2001","Ja\nJa","M160201PET02\nM170501HUG03","4179438\n5178950","26.04.2016\n","Norske Studenters Roklub\nNorske Studenters Roklub","Tor-geir Myhrer\n","90060234\n","rosjefen@gmail.com\n","17.08.2016\n17.08.2016"]
["121F9",0,"Lør 27.8","121F",null,"1420","0930",null,null,null,null,null,526,null,null,null,2,9,2,null,null,null,null,"H","H J B","2x",null,"500 m ","Bærum Roklubb 1","Eirik Myreng Hauge\nLars Moberg Værnes",null,325,null,"Bærum Roklubb",null,null,"17.04.2000\n02.06.2000","Ja\nJa","M170400EIR02\nM020600LAR02","5005277\n4487587","29.04.2016\n29.04.2016","Bærum Roklubb\nBærum Roklubb","Anders Hovde\n","90775520\n","anders.hovde@tns-gallup.no\n","17.08.2016\n17.08.2016"]
["121F10",0,"Lør 27.8","121F",null,"1420","0930",null,null,null,null,null,673,null,null,null,2,10,2,null,null,null,null,"H","H J B","2x",null,"500 m ","Tønsberg Roklub 1","Lars Jørann Lindgren\nIsak Vartal-Gjerde",null,325,null,"Tønsberg Roklub",null,null,"30.05.2001\n24.12.2000","Ja\nJa","M300501LAR02\nM241200ISA03","4234298\n7173184","15.04.2016\n15.04.2016","Tønsberg Roklub\nTønsberg Roklub","Tore Nilsson\n","92686272\n","tore.nilsson@sf-nett.no\n","17.08.2016\n17.08.2016"]
{"$rows_left_out":265}
{"sheet":"Søndg løp","index":5,"n_rows":48,"n_cols":8,"rows_kept":48,"cut":false,"hidden":false,"merged":[[0,0,0,7],[2,1,2,2],[5,0,5,7]]}
["LØPSOPPSETT SØNDAG"]
["DAG","Løp nr.","Kjønn","Klasse","Båttype","Distanse","ANNET","Startkontingent"]
["Søndag","FORSØKSLØP\nFORSØKSLØP"]
[null,201,"H","JB","1x",500,"K",275]
[null,202,"D","JB","1x",500," ",275]
["Pause\nLAGLEDERMØTE kl. 11.00"]
[null,203,"D/H","Nybeg","Åpen",500," ",150]
[null,204,"D/H","JD","1x",500,null,275]
[null,205,"D","JA","8+",500,"SP/K",475]
[null,206,"H","JC","1x",500," ",275]
[null,207,"D","JC","2x",500," ",325]
[null,208,"D","S","1x",500,"K",275]
[null,209,"D","JA","2x",500,"K",325]
[null,210,"D","S","2-",500,null,325]
[null,211,"H","JA","1x",500,"SP",275]
{"$rows_left_out":34}
{"sheet":"LØPSOPPSETT OPPSLAG","index":6,"n_rows":203,"n_cols":12,"rows_kept":203,"cut":false,"hidden":true,"merged":[[48,1,48,2],[51,0,51,7]]}
["LØPSOPPSETT LØRDAG"]
["Dag","Løp nr.","Kjønn","Klasse","Båttype","Distanse","ANNET","START\nFINALE"]
["LØRDAG","FORSØKSLØP\nFORSØKSLØP"]
[null,101,"H","JB","1x",500," ","12:45:00"]
[null,102,"D","JB","1x",500,"K","14:40:00"]
["Pause\nLAGLEDERMØTE kl. 11.00"]
[]
[null,103,"D/H","Nybeg","Åpen",500," ","12:00:00"]
[null,104,"D/H","JD","2x",500," ","12:05:00"]
[null,105,"H","JA","8+",500,"SP/K","14:00:00"]
[null,106,"H","JC","1x",500," ","12:10:00"]
[null,107,"D","JC","2x",500," ","12:20:00"]
[null,108,"D","S","1x",500,"SP","12:25:00"]
[null,109,"D","JA","2x",500,"SP","12:35:00"]
[null,110,"D","S","2-",500,null,"14:20:00"]
{"$rows_left_out":189}
{"sheet":"Søndag Trekning","index":7,"n_rows":300,"n_cols":46,"rows_kept":300,"cut":false,"hidden":false,"merged":[]}
[{"$f":"COLUMNS($A1:A1)","v":1},{"$f":"COLUMNS($A1:B1)","v":2},{"$f":"COLUMNS($A1:C1)","v":3},{"$f":"COLUMNS($A1:D1)","v":4},{"$f":"COLUMNS($A1:E1)","v":5},{"$f":"COLUMNS($A1:F1)","v":6},{"$f":"COLUMNS($A1:G1)","v":7},{"$f":"COLUMNS($A1:H1)","v":8},{"$f":"COLUMNS($A1:I1)","v":9},{"$f":"COLUMNS($A1:J1)","v":10},{"$f":"COLUMNS($A1:K1)","v":11},{"$f":"COLUMNS($A1:L1)","v":12},{"$f":"COLUMNS($A1:M1)","v":13},{"$f":"COLUMNS($A1:N1)","v":14},{"$f":"COLUMNS($A1:O1)","v":15},{"$f":"COLUMNS($A1:P1)","v":16},{"$f":"COLUMNS($A1:Q1)","v":17},{"$f":"COLUMNS($A1:R1)","v":18},19,20,21,{"$f":"COLUMNS($A1:V1)","v":22},{"$f":"COLUMNS($A1:W1)","v":23},{"$f":"COLUMNS($A1:X1)","v":24},{"$f":"COLUMNS($A1:Y1)","v":25},{"$f":"COLUMNS($A1:Z1)","v":26},null,{"$f":"COLUMNS($A1:AB1)","v":28},{"$f":"COLUMNS($A1:AC1)","v":29},{"$f":"COLUMNS($A1:AD1)","v":30},{"$f":"COLUMNS($A1:AE1)","v":31},{"$f":"COLUMNS($A1:AF1)","v":32},{"$f":"COLUMNS($A1:AG1)","v":33},{"$f":"COLUMNS($A1:AH1)","v":34},{"$f":"COLUMNS($A1:AI1)","v":35},{"$f":"COLUMNS($A1:AJ1)","v":36},{"$f":"COLUMNS($A1:AK1)","v":37},{"$f":"COLUMNS($A1:AL1)","v":38},{"$f":"COLUMNS($A1:AM1)","v":39},{"$f":"COLUMNS($A1:AN1)","v":40},{"$f":"COLUMNS($A1:AO1)","v":41},{"$f":"COLUMNS($A1:AP1)","v":42},{"$f":"COLUMNS($A1:AQ1)","v":43},{"$f":"COLUMNS($A1:AR1)","v":44},{"$f":"COLUMNS($A1:AS1)","v":45},{"$f":"COLUMNS($A1:AT1)","v":46}]
[null,null,null,null,null,null,null,null,null,null,null,null,null,null,null,null,null,null,3,5,6]
[null,null,null,null,null,null,null,null,null,null,null,null,null,null,null,null,null,{"$f":"SUBTOTAL(3,R4:R299)-1","v":242},null,null,null,null,null,null,null,null,{"$f":"SUBTOTAL(9,AA4:AA299)-1","v":{"$error":"#VALUE!"}},null,{"$f":"SUBTOTAL(3,AC4:AC299)-1","v":235}]
["ID","Oppslag","LØPSDAG","LØP NR","Plassering","Start Finale","Start Forsøk","Veiing","Forsøk","Slått ut","Semifinale","Start Forsøk","Rendom 1","random","Sprintmesterskap (S)","Kretsmesterslap (K)","Heat","Startnr","Heat actual","Plassering","Tid","Plass x Heat","Poeng","Kjønn","Klasse","Båttype","Deltakere (seter)","Distanse","Roklubb","ROERE","NC Kvalifisering Nordisk/Baltic","START-KONTIGENT","Etteranmeldt/Strøket","Påmeldene/Betalende klubb","Betaling registrert","Betalingstransaksjon","Fødselsdato","Påmelding innenfor klasse (ja/nei)","Idrettsnummer","Person ID","Betalt lisens","\"Hjemme-klubb\"","Påmeldt av (person)","Mobil","E-post","Påmeldt dato"]
[]
[]
[{"$f":"D7&R7","v":"209F0"},1,"Søn 28.8","209F",null,{"$f":"VLOOKUP($D7,Tidsplan!$B:$D,3,FALSE)","v":"1240"},{"$f":"VLOOKUP($D7,Tidsplan!$B:$D,2,FALSE)","v":"0915"},null,null,null,null,null,null,null," ","K",null,0,null,null,null,null,null,"H","H J B","2x",{"$f":"IF(R7<>0,LEFT(Z7,1),0)*1","v":0},"500 m "]
["209F1",{"$f":"OFFSET(B8,-1,0)","v":1},"Søn 28.8","209F",null,{"$f":"OFFSET(F8,-1,0)","v":"1240"},"0915",null,null,null,null,null,null,{"$f":"RANDBETWEEN(0,1000)","v":716},null,null,1,1,1,null,null,null,null,"D","D J A","2x",null,"500 m ","Bærum Roklubb 1","Synnøve Gillebo Foss\nKlara Moene Omholt",null,325,null,"Bærum Roklubb",null,null,"11.08.1999\n17.03.1998","Ja\nJa","K110899SYN02\nK170398KLA02","5218490\n5645099","29.04.2016\n29.04.2016","Bærum Roklubb\nBærum Roklubb","Anders Hovde\n","90775520\n","anders.hovde@tns-gallup.no\n","17.08.2016\n17.08.2016"]
["209F2",1,"Søn 28.8","209F",null,"1240","0915",null,null,null,null,null,null,27,null,null,1,2,1,null,null,null,null,"D","D J A","2x",null,"500 m ","Christiania Roklub 1","Aurora Olsen Junklesad\nHermine Wilhelmsen",null,325,null,"Christiania Roklub",null,null,"02.12.1998\n23.07.1999","Ja\nJa","K021298AUR02\nK230799HER03","5674631\n5674641","\n06.03.2016","Ukjent/ikke registrert klubb\nChristiania Roklub","Grete Isachsen Stokke\n","91338845\n","grisach@gmail.com\n","16.08.2016\n16.08.2016"]
["209F3",1,"Søn 28.8","209F",null,"1240","0915",null,null,null,null,null,null,652,null,null,1,3,1,null,null,null,null,"D","D J A","2x",null,"500 m ","Drammen Roklubb  1","Karoline Rydland Masch\nSara Seip",null,325,null,"Drammen Roklubb ",null,null,"14.04.2001\n09.05.1998","Nei\nJa","K140401KAR10\nK090598SAR05","7214275\n5313667","06.04.2016\n15.03.2016","Drammen Roklubb \nDrammen Roklubb ","Øyvind Leirset\n","40069485\n","oeylei@online.no;Oeylei@online.no\n","17.08.2016\n17.08.2016"]
["209F4",1,"Søn 28.8","209F",null,"1240","0915",null,null,null,null,null,null,171,null,null,1,4,1,null,null,null,null,"D","D J A","2x",null,"500 m ","Norske Studenters Roklub 1","Hanna Kaupang Petersen\nElisabeth Astrup Wiik",null,325,null,"Norske Studenters Roklub",null,null,"15.09.2000\n01.11.1998","Nei\nJa","K150900HAN01\nK011198ELI04","2581292\n5993806","26.04.2016\n26.04.2016","Norske Studenters Roklub\nNorske Studenters Roklub","Tor-geir Myhrer\n","90060234\n","rosjefen@gmail.com\n","17.08.2016\n17.08.2016"]
["209F5",1,"Søn 28.8","209F",null,"1240","0915",null,null,null,null,null,null,150,null,null,2,5,2,null,null,null,null,"D","D J A","2x",null,"500 m ","Norske Studenters Roklub 2/\nFredrikstad","Emilie Stabe Helvig\nMarie Fensbekk Grønneberg",null,325,null,"Norske Studenters Roklub",null,null,"03.04.1998\n27.12.1998","Ja\nJa","K030498EMI01\nK271298MAR04","5296622\n2633539","26.04.2016\n13.04.2016","Norske Studenters Roklub\nFredriksstad Roklub,Sarpsborg Roklubb - Roing","Tor-geir Myhrer\n","90060234\n","rosjefen@gmail.com\n","17.08.2016\n17.08.2016"]
["209F6",1,"Søn 28.8","209F",null,"1240","0915",null,null,null,null,null,null,780,null,null,2,6,2,null,null,null,null,"D","D J A","2x",null,"500 m ","Ormsund Roklub 1","Rikke Aslaksen Wåle",null,325,null,"Ormsund Roklub",null,null,"19.03.1999","Ja","K190399RIK03","6077550","11.03.2016","Ormsund Roklub","Antje Peine","+4792863244","antjep13@gmail.com","17.08.2016"]
["209F7",1,"Søn 28.8","209F",null,"1240","0915",null,null,null,null,null,null,643,null,null,2,7,2,null,null,null,null,"D","D J A","2x",null,"500 m ","Sarpsborg Roklubb - Roing 1","Kavi Ali\nCornelia Knutsen",null,325,null,"Sarpsborg Roklubb - Roing",null,null,"04.07.1998\n28.12.2000","Ja\nNei","K040798KAV02\nK281200COR02","2739661\n6060150","10.04.2016\n10.04.2016","Sarpsborg Roklubb - Roing\nSarpsborg Roklubb - Roing","Thomas Gundersen\n","91874904\n","Thomas.gundersen@afgruppen.no;thomas.gundersen@afgruppen.no\n","17.08.2016\n17.08.2016"]
[null,null," "]
{"$rows_left_out":286}
{"sheet":"Krysstabell","index":8,"n_rows":32,"n_cols":9,"rows_kept":32,"cut":false,"hidden":false,"merged":[[0,0,0,8],[20,0,21,0],[2,0,3,0],[4,0,5,0],[6,0,7,0],[8,0,9,0],[10,0,11,0],[12,0,13,0],[14,0,15,0],[16,0,17,0],[18,0,19,0],[22,0,23,0],[24,0,25,0],[26,0,27,0],[28,0,29,0],[30,0,31,0]]}
["KRYSSTABELL LØP"]
["KLASSE","Dag","1x","2x","2-","4x","4-","8+","Åpen"]
["Damer Senior","Lørdag",108,118,110,128,null,144]
[null,"Søndag",208,218,210,228]
["Damer Senior Lv","Lørdag",138,126]
[null,"Søndag",238,226]
["Damer Master","Lørdag",143,125,null,113]
[null,"Søndag",243,225,null,213]
["Damer Junior A","Lørdag",122,109,129,136,116]
[null,"Søndag",222,209,229,236,216,205]
["Damer Junior B","Lørdag",102,132,null,123]
[null,"Søndag",202,232,null,223]
["Damer Junior C","Lørdag",120,107]
[null,"Søndag",220,207]
["Herrer Senior","Lørdag",115,127,135,139]
{"$rows_left_out":18}
{"sheet":"FORMATERINGER","index":9,"n_rows":10,"n_cols":19,"rows_kept":10,"cut":false,"hidden":true,"merged":[]}
["LØP NR","Finaler/heat","Forsøk og\nOppsamling","Tidspunkt\nforsøk","Tidspunkt \noppsamling","Tidspunkt \nveiing","Plassering","TID:","START NR","Kjønn","Klasse","Båttype","Distanse","ROKLUBB","ROERE","OKR JUBILEUMSLØP","START\nFINALE","START-KONTIGENT","Etteranmeldt\n/ Strøket"]
[200,"A",1,"10.30","11.30","10.45",0,0,0,"Mix","Mas","2X",1000,null,null,"OKR","11:00:00","200"]
[]
[215,"A",2,"10.30","11.30","10.45",0,0,0,"H","S","2-",2000,null,null,null,"Utgår","200"]
[]
[200,"A",1,"10.30","11.30","10.45",1,"07.36.04",1,"M","Mas","2X",1000,"NSR","NN\nNN","OKR","11:00:00",400,"X"]
[]
[]
["NB ! Fra denne folder skal du kun kopiere formatet, ikke innholdet i cellene !"]
["Sett derfor din cursor i ønsket rad helt i venstre marg, velg \"format painter\" og kopier over til folder LØRDAG eller SØNDAG"]

{"sheet":"Startnr","index":10,"n_rows":23,"n_cols":33,"rows_kept":23,"cut":false,"hidden":true,"merged":[]}
["LØP NR","(Multiple Items)"]
["Etteranmeldt/Strøket","(Multiple Items)"]
[]
["Count of Start nr",null,"N"]
["LØPSDAG","Påmeldene/Betalende klubb",1,2,3,4,5,6,7,8,9,10,11,12,13,14,15,16,17,18,19,20,21,22,23,24,25,26,27,28,29,30,"Grand Total"]
["Lør 22.8",null,26,24,17,15,17,11,9,10,7,6,7,7,6,4,3,3,3,2,2,2,2,1,null,1,1,1,1,null,1,1,190]
["Søn 23.8","Bestumkilen Roklubb",3,null,null,null,null,null,null,null,null,null,null,null,null,null,null,null,null,null,null,null,null,null,null,null,null,null,null,null,null,null,3]
[null,"Bærum Roklubb",9,2,4,5,2,2,1,1,1,1,1,2,null,1,1,2,null,null,null,null,1,null,null,null,1,null,null,null,null,1,38]
[null,"Christiania Roklub",3,2,2,3,1,null,1,null,1,1,null,1,null,null,null,null,1,null,null,null,null,null,null,null,null,null,null,null,null,null,16]
[null,"Drammen Roklubb ",null,1,null,1,2,1,1,1,null,1,null,null,1,null,null,null,null,null,null,null,null,null,null,null,null,null,null,null,null,null,9]
[null,"Fredriksstad Roklub",1,2,1,null,null,null,null,1,null,null,null,null,null,null,null,null,1,null,null,null,null,null,null,null,null,null,null,null,null,null,6]
[null,"Haldens Roklub",null,1,1,1,null,1,null,null,null,null,null,null,null,null,1,null,null,null,null,null,null,null,null,null,null,null,null,null,null,null,5]
[null,"Horten Roklubb",2,1,1,3,4,1,1,1,null,1,null,1,1,1,null,null,null,2,1,null,null,null,1,1,null,null,1,null,null,null,24]
[null,"Moss Roklubb",null,5,2,null,2,1,null,2,1,2,1,null,1,null,null,null,null,null,null,null,null,null,null,null,null,null,null,null,null,null,17]
[null,"Norske Studenters Roklub",3,8,3,2,3,null,2,1,3,null,1,1,null,null,null,null,null,null,null,1,1,null,null,null,null,null,null,1,1,null,31]
{"$rows_left_out":9}
{"sheet":"KART","index":11,"n_rows":2,"n_cols":5,"rows_kept":2,"cut":false,"hidden":false,"merged":[[1,4,1,10],[0,8,0,14]]}
[]
[null,null,null,null,"For Kart - Parkering, Innkjøring  & Trafikkregler på banen se innbydelsen på Sportsadmin.no"]